patno,grade,resdis,ps,ascites,survtime,cens,trial,alb,age,figo,histol,ctype,surg,chem,ca125,alp,st,d,t,t0
1,,<2 cm,0,present,2611,0,in trial,,45.678303,I,Mucinous,platinum-based,1,1,128,42.000004,1,0,7.148528405,0
2,moderately differentiated,>5 cm,0,absent,427,1,not in trial,42,70.108147,III,Serous papillary,non platinum-based,1,1,,76,1,1,1.169062286,0
3,poorly differentiated,<2 cm,,present,823,1,not in trial,,82.655716,III,Mesonephroid (clear cell),none,1,0,,,1,1,2.253251198,0
4,poorly differentiated,<2 cm,1,absent,876,1,in trial,41,46.984257,III,Adenocarcinoma,platinum-based,1,1,9,69,1,1,2.39835729,0
5,moderately differentiated,>5 cm,0,present,530,1,not in trial,36,65.724846,IV,Serous papillary,non platinum-based,1,1,,69.999992,1,1,1.451060917,0
6,well differentiated,<2 cm,,present,3454,0,in trial,,38.332649,I,Serous papillary,none,1,0,,,1,0,9.456536619,0
7,poorly differentiated,2-5 cm,1,present,374,1,not in trial,33,51.10746,III,Serous papillary,platinum-based,1,1,209.99997,106.00002,1,1,1.023956194,0
8,poorly differentiated,>5 cm,1,absent,204,1,not in trial,40,63.720737,III,Serous papillary,non platinum-based,1,1,1689.9998,179.00005,1,1,0.558521561,0
9,poorly differentiated,<2 cm,0,absent,4024,0,in trial,42,44.068447,I,Mucinous,none,1,0,28.999998,75.000008,1,0,11.01711157,0
10,poorly differentiated,>5 cm,,present,869,1,in trial,,42.573578,III,Serous papillary,non platinum-based,1,1,,,1,1,2.379192334,0
11,well differentiated,<2 cm,0,present,4844,1,in trial,45,60.490074,I,Endometrioid,none,1,0,,223.99997,1,1,13.26214921,0
12,well differentiated,<2 cm,1,present,2524,1,not in trial,44,56.501026,I,Endometrioid,non platinum-based,1,1,19,82.999985,1,1,6.910335387,0
13,poorly differentiated,<2 cm,0,absent,1652,1,in trial,37,67.518135,II,Mucinous,platinum-based,1,1,38,108.00001,1,1,4.5229295,0
14,poorly differentiated,2-5 cm,1,absent,403,1,in trial,46,57.423683,II,Serous papillary,platinum-based,1,1,2950.0005,65.000015,1,1,1.103353867,0
15,well differentiated,<2 cm,0,present,571,1,not in trial,41,45.284054,II,Serous papillary,non platinum-based,1,1,109.69997,83.999985,1,1,1.563312799,0
16,,>5 cm,3��4��,present,182,1,in trial,42,71.597534,,Adenocarcinoma,platinum-based,0,1,,96.999985,1,1,0.498288843,0
17,moderately differentiated,<2 cm,,present,3398,1,in trial,,64.793976,I,Mucinous,none,1,0,182.99997,,1,1,9.303216975,0
18,moderately differentiated,>5 cm,1,present,985,1,not in trial,33,67.268997,III,Serous papillary,non platinum-based,1,1,52.999996,66.000008,1,1,2.696783025,0
19,poorly differentiated,2-5 cm,1,absent,626,1,not in trial,43,48.372349,III,Mucinous,platinum-based,1,1,382.00006,60.000004,1,1,1.713894593,0
20,poorly differentiated,<2 cm,0,present,1960,1,not in trial,48,57.040382,II,Serous papillary,none,1,0,,100.00001,1,1,5.366187543,0
21,well differentiated,<2 cm,,absent,3821,0,in trial,,59.676933,I,Endometrioid,none,1,0,,,1,0,10.46132786,0
22,poorly differentiated,<2 cm,0,absent,4348,0,in trial,44,43.383984,II,Serous papillary,platinum-based,1,1,51,89.000008,1,0,11.90417522,0
23,moderately differentiated,<2 cm,0,absent,321,1,not in trial,38,55.679672,I,Endometrioid,platinum-based,1,1,12,89.000008,1,1,0.878850103,0
24,poorly differentiated,<2 cm,0,absent,788,1,in trial,,76.517456,I,Serous papillary,platinum-based,1,1,931.00006,,1,1,2.15742642,0
25,well differentiated,<2 cm,,absent,1058,1,not in trial,,60.613277,I,Serous papillary,none,1,0,120.00001,,1,1,2.896646133,0
26,moderately differentiated,<2 cm,2,present,561,1,in trial,42,79.230667,III,Serous papillary,platinum-based,1,1,76,,1,1,1.535934292,0
27,poorly differentiated,<2 cm,0,present,560,1,not in trial,47,32.33128,III,Serous papillary,non platinum-based,1,1,,66.000008,1,1,1.533196441,0
28,moderately differentiated,2-5 cm,2,present,746,1,in trial,42,59.835728,III,Serous papillary,platinum-based,1,1,5509.9995,114,1,1,2.042436687,0
29,moderately differentiated,<2 cm,,absent,3155,0,in trial,,55.455166,I,Mucinous,none,1,0,130.00003,,1,0,8.637919233,0
30,moderately differentiated,2-5 cm,1,present,231,1,in trial,41,78.209442,IV,Endometrioid,platinum-based,1,1,68,76.999992,1,1,0.632443532,0
31,poorly differentiated,>5 cm,1,absent,151,1,in trial,34,47.011635,IV,Mesonephroid (clear cell),platinum-based,1,1,170,545.00012,1,1,0.413415469,0
32,well differentiated,<2 cm,0,absent,4417,0,in trial,,69.982201,II,Endometrioid,platinum-based,1,1,17.800001,,1,0,12.09308693,0
33,poorly differentiated,>5 cm,,present,37,1,not in trial,38,61.136208,III,Serous papillary,platinum-based,1,1,29.899998,100.99999,1,1,0.101300479,0
34,poorly differentiated,2-5 cm,1,present,78,1,in trial,30,60.375084,III,Serous papillary,platinum-based,1,1,,156.00003,1,1,0.213552361,0
35,moderately differentiated,2-5 cm,,present,551,1,in trial,37,67.345657,IV,Serous papillary,none,1,0,,125.99998,1,1,1.508555784,0
36,poorly differentiated,<2 cm,,absent,2894,1,in trial,43,65.223816,II,Serous papillary,none,1,0,,85,1,1,7.923340178,0
37,poorly differentiated,>5 cm,0,present,538,1,not in trial,40,52.769337,III,Serous papillary,non platinum-based,1,1,1749.9999,64,1,1,1.472963723,0
38,well differentiated,<2 cm,,absent,2118,1,in trial,,37.856262,I,Endometrioid,none,1,0,,,1,1,5.798767967,0
39,poorly differentiated,<2 cm,3��4��,absent,528,1,in trial,,73.779602,II,Mucinous,none,1,0,,,1,1,1.445585216,0
40,poorly differentiated,>5 cm,1,absent,2005,1,in trial,32,67.255302,III,Undifferentiated,platinum-based,1,1,556.99994,90.000008,1,1,5.489390828,0
41,moderately differentiated,>5 cm,1,absent,777,1,not in trial,42,55.567421,III,Serous papillary,non platinum-based,1,1,,92,1,1,2.127310062,0
42,moderately differentiated,<2 cm,0,absent,2780,1,in trial,,74.195755,I,Serous papillary,none,1,0,,,1,1,7.611225188,0
43,,<2 cm,,absent,1433,1,in trial,,55.5154,I,Serous papillary,none,1,0,17,,1,1,3.923340178,0
44,poorly differentiated,>5 cm,,present,375,1,in trial,,59.074608,III,Serous papillary,platinum-based,1,1,,,1,1,1.026694045,0
45,poorly differentiated,>5 cm,1,present,296,1,not in trial,44,73.522247,IV,Serous papillary,non platinum-based,1,1,72,102,1,1,0.810403833,0
46,poorly differentiated,2-5 cm,0,absent,1789,1,not in trial,39,64.279259,IV,Mesonephroid (clear cell),non platinum-based,1,1,,142.00003,1,1,4.898015058,0
47,moderately differentiated,2-5 cm,0,present,566,1,not in trial,41,54.669403,IV,Serous papillary,non platinum-based,1,1,519.00006,117.00002,1,1,1.549623546,0
48,poorly differentiated,<2 cm,0,present,359,1,not in trial,41,60.123203,III,Serous papillary,non platinum-based,1,1,6827.002,109.00002,1,1,0.982888433,0
49,poorly differentiated,<2 cm,0,,743,1,in trial,44,45.544147,III,Adenocarcinoma,non platinum-based,1,1,,98.000015,1,1,2.034223135,0
50,poorly differentiated,2-5 cm,0,present,122,1,not in trial,26,68.646133,III,Mesonephroid (clear cell),non platinum-based,1,1,363.00006,296.00003,1,1,0.334017796,0
51,moderately differentiated,2-5 cm,3��4��,absent,498,1,in trial,30,72.733742,II,Mesonephroid (clear cell),none,1,0,,75.000008,1,1,1.363449692,0
52,poorly differentiated,>5 cm,1,present,128,1,in trial,35,69.620811,IV,Serous papillary,platinum-based,1,1,477.00009,390.00009,1,1,0.350444901,0
53,poorly differentiated,<2 cm,0,present,798,1,not in trial,44,54.839149,III,Serous papillary,non platinum-based,1,1,,132.00002,1,1,2.184804928,0
54,poorly differentiated,>5 cm,3��4��,present,23,1,in trial,32,80.796715,IV,Serous papillary,platinum-based,1,1,,86.999992,1,1,0.062970568,0
55,poorly differentiated,<2 cm,0,absent,368,1,in trial,38,59.186859,III,Mixed mesodermal,platinum-based,1,1,12.999999,78.999992,1,1,1.00752909,0
56,poorly differentiated,>5 cm,,present,674,1,in trial,33,54.989735,III,Serous papillary,platinum-based,1,1,651.99988,67.000015,1,1,1.845311431,0
57,poorly differentiated,<2 cm,0,present,948,1,in trial,,54.66119,III,Serous papillary,non platinum-based,1,1,433.99991,,1,1,2.595482546,0
58,poorly differentiated,<2 cm,0,present,2050,1,not in trial,37,58.379192,III,Mucinous,non platinum-based,1,1,100.00001,115.00001,1,1,5.612594114,0
59,poorly differentiated,<2 cm,1,present,710,1,not in trial,33,58.026009,III,Serous papillary,non platinum-based,1,1,327.00006,82,1,1,1.943874059,0
60,poorly differentiated,>5 cm,1,present,601,1,in trial,42,45.779602,IV,Mucinous,platinum-based,1,1,35.000004,621.00006,1,1,1.645448323,0
61,poorly differentiated,>5 cm,2,absent,2738,1,in trial,34,74.13826,IV,Endometrioid,platinum-based,1,1,85.800018,153,1,1,7.496235455,0
62,poorly differentiated,<2 cm,,present,835,1,in trial,44,69.585213,I,Mucinous,platinum-based,1,1,,100.99999,1,1,2.286105407,0
63,poorly differentiated,>5 cm,1,present,573,1,in trial,44,68.065712,III,Serous papillary,platinum-based,1,1,,88.000008,1,1,1.568788501,0
64,,>5 cm,2,,60,1,in trial,,69.98494,IV,Undifferentiated,platinum-based,0,1,,139.00002,1,1,0.164271047,0
65,poorly differentiated,<2 cm,0,absent,3913,0,in trial,42,58.825462,II,Mucinous,platinum-based,1,1,17,76,1,0,10.71321013,0
66,,>5 cm,0,present,393,1,not in trial,41,54.444901,III,Serous papillary,non platinum-based,1,1,,108.00001,1,1,1.075975359,0
67,moderately differentiated,<2 cm,,absent,2879,0,in trial,,56.492813,I,Mucinous,platinum-based,1,1,14.9,57.999996,1,0,7.882272416,0
68,poorly differentiated,<2 cm,0,,809,1,in trial,30,71.926079,II,Mucinous,non platinum-based,1,1,400.00003,118.99998,1,1,2.214921287,0
69,poorly differentiated,2-5 cm,0,present,419,1,in trial,,75.140312,III,Mucinous,none,1,0,,,1,1,1.14715948,0
70,moderately differentiated,<2 cm,1,absent,2823,0,in trial,45,50.795345,I,Mucinous,platinum-based,1,1,43.000004,242.00003,1,0,7.728952772,0
71,poorly differentiated,>5 cm,2,present,97,1,in trial,40,66.943192,IV,Serous papillary,platinum-based,1,1,710.00012,111.00002,1,1,0.265571526,0
72,moderately differentiated,<2 cm,0,present,1754,1,not in trial,43,65.891853,II,Serous papillary,non platinum-based,1,1,,94.000015,1,1,4.802190281,0
73,,<2 cm,0,absent,5571,0,in trial,46,45.4538,II,Mucinous,none,1,0,,66.000008,1,0,15.25256674,0
74,poorly differentiated,>5 cm,3��4��,present,15,1,in trial,,44.648872,III,Serous papillary,none,1,0,,,1,1,0.041067762,0
75,poorly differentiated,>5 cm,,absent,730,1,not in trial,39,61.516769,II,Serous papillary,non platinum-based,1,1,,102.99999,1,1,1.998631075,0
76,well differentiated,<2 cm,0,present,1699,1,not in trial,44,64.377823,III,Serous papillary,non platinum-based,1,1,,80,1,1,4.651608487,0
77,poorly differentiated,>5 cm,,present,179,1,not in trial,40,56.306641,III,Serous papillary,non platinum-based,1,1,,85,1,1,0.490075291,0
78,poorly differentiated,<2 cm,0,present,2981,0,in trial,40,59.534565,I,Endometrioid,platinum-based,1,1,66.000008,92.999992,1,0,8.161533196,0
79,,<2 cm,,absent,658,1,in trial,,69.51403,I,Serous papillary,none,1,0,83.999985,,1,1,1.801505818,0
80,poorly differentiated,<2 cm,0,present,914,1,in trial,,67.036278,I,Mucinous,platinum-based,1,1,69,,1,1,2.502395619,0
81,poorly differentiated,>5 cm,1,absent,646,1,not in trial,34,75.696098,III,Serous papillary,non platinum-based,1,1,1339.9998,115.99999,1,1,1.768651608,0
82,poorly differentiated,<2 cm,1,absent,2565,0,not in trial,39,54.09993,I,Mesonephroid (clear cell),platinum-based,1,1,55.999992,76,1,0,7.022587269,0
83,well differentiated,<2 cm,0,absent,1703,1,in trial,39,65.757698,II,Serous papillary,none,1,0,,81.000008,1,1,4.66255989,0
84,,<2 cm,0,absent,4861,0,not in trial,43,56.752911,II,Mucinous,non platinum-based,1,1,797.99982,82.999985,1,0,13.30869268,0
85,moderately differentiated,<2 cm,0,absent,682,1,not in trial,44,66.710472,II,Serous papillary,non platinum-based,1,1,30.000002,78.999992,1,1,1.867214237,0
86,,<2 cm,3��4��,present,272,1,not in trial,36,60.646133,III,Mesonephroid (clear cell),non platinum-based,1,1,532.40009,92,1,1,0.744695414,0
87,poorly differentiated,<2 cm,,present,446,1,in trial,,74.242302,IV,Serous papillary,platinum-based,1,1,,,1,1,1.221081451,0
88,moderately differentiated,2-5 cm,0,present,351,1,not in trial,43,59.493496,III,Mucinous,non platinum-based,1,1,35.000004,125.99998,1,1,0.960985626,0
89,well differentiated,>5 cm,1,present,132,1,not in trial,31,67.523613,III,Serous papillary,non platinum-based,1,1,2250.0002,82,1,1,0.361396304,0
90,well differentiated,<2 cm,,absent,578,1,in trial,32,54.592743,I,Endometrioid,none,1,0,,,1,1,1.582477755,0
91,poorly differentiated,<2 cm,0,absent,783,1,not in trial,45,29.125257,IV,Serous papillary,non platinum-based,1,1,52.999996,118.00001,1,1,2.143737166,0
92,poorly differentiated,2-5 cm,1,absent,506,1,not in trial,40,63.80835,IV,Serous papillary,non platinum-based,1,1,418.80005,109.00002,1,1,1.385352498,0
93,moderately differentiated,>5 cm,1,present,297,1,not in trial,29,68.010948,III,Serous papillary,platinum-based,1,1,539.00012,99.000008,1,1,0.813141684,0
94,,>5 cm,,present,111,1,in trial,35,66.850105,IV,Serous papillary,platinum-based,1,1,467.00006,156.00003,1,1,0.303901437,0
95,well differentiated,2-5 cm,3��4��,present,357,1,in trial,31,58.762493,III,Mucinous,platinum-based,1,1,,150.00002,1,1,0.977412731,0
96,poorly differentiated,>5 cm,3��4��,present,162,1,in trial,32,75.594795,III,Serous papillary,platinum-based,1,1,1248.9998,117.00002,1,1,0.443531828,0
97,,>5 cm,1,present,76,1,not in trial,33,59.279945,IV,Endometrioid,non platinum-based,1,1,,88.000008,1,1,0.20807666,0
98,poorly differentiated,<2 cm,,present,116,1,in trial,40,55.466118,III,Mesonephroid (clear cell),platinum-based,1,1,,125.00001,1,1,0.317590691,0
99,moderately differentiated,<2 cm,,absent,3265,0,in trial,,66.940453,I,Mesonephroid (clear cell),none,1,0,,,1,0,8.93908282,0
100,,2-5 cm,,,125,1,in trial,,71.545517,III,Mixed mesodermal,none,1,0,,,1,1,0.342231348,0
101,poorly differentiated,<2 cm,0,present,344,1,not in trial,41,55.151268,III,Mixed mesodermal,platinum-based,1,1,,220.00002,1,1,0.941820671,0
102,poorly differentiated,>5 cm,2,present,157,1,not in trial,29,58.321697,IV,Undifferentiated,non platinum-based,0,1,487.99991,157.99998,1,1,0.429842574,0
103,poorly differentiated,>5 cm,0,present,478,1,not in trial,42,60.594112,III,Serous papillary,non platinum-based,1,1,,69.999992,1,1,1.308692676,0
104,poorly differentiated,<2 cm,0,absent,435,1,in trial,39,53.013004,I,Serous papillary,platinum-based,1,1,22.000002,74.000008,1,1,1.190965092,0
105,poorly differentiated,>5 cm,1,absent,415,1,in trial,39,72.136894,IV,Serous papillary,platinum-based,1,1,542.99988,320.99997,1,1,1.136208077,0
106,poorly differentiated,<2 cm,0,absent,169,1,not in trial,39,59.753593,IV,Serous papillary,non platinum-based,1,1,385.99994,82.999985,1,1,0.462696783,0
107,,>5 cm,1,present,118,1,in trial,32,65.292267,III,Undifferentiated,platinum-based,0,1,490.00009,104.00002,1,1,0.323066393,0
108,poorly differentiated,<2 cm,0,,260,1,not in trial,44,65.604378,II,Serous papillary,none,1,0,,100.00001,1,1,0.711841205,0
109,poorly differentiated,2-5 cm,,absent,185,1,not in trial,35,56.835045,III,Endometrioid,platinum-based,1,1,,89.000008,1,1,0.506502396,0
110,moderately differentiated,<2 cm,1,present,959,1,not in trial,40,50.494183,III,Serous papillary,platinum-based,1,1,617.99994,91,1,1,2.625598905,0
111,poorly differentiated,>5 cm,,present,222,1,in trial,35,67.843941,III,Serous papillary,platinum-based,1,1,542.00006,69,1,1,0.607802875,0
112,,2-5 cm,0,present,125,1,in trial,40,46.354553,III,Mesonephroid (clear cell),platinum-based,1,1,170,106.99998,1,1,0.342231348,0
113,well differentiated,<2 cm,,present,797,1,in trial,,63.761806,I,Endometrioid,none,1,0,,,1,1,2.182067077,0
114,well differentiated,<2 cm,0,present,1265,1,not in trial,38,35.70705,III,Serous papillary,non platinum-based,1,1,35.000004,,1,1,3.463381246,0
115,moderately differentiated,2-5 cm,0,present,212,1,not in trial,35,69.177277,III,Serous papillary,non platinum-based,1,1,13.900001,104.00002,1,1,0.580424367,0
116,poorly differentiated,<2 cm,1,present,438,1,not in trial,42,73.615334,III,Mesonephroid (clear cell),non platinum-based,1,1,117.00002,88.000008,1,1,1.199178645,0
117,moderately differentiated,<2 cm,0,present,2302,1,not in trial,48,60.298428,III,Mesonephroid (clear cell),non platinum-based,1,1,42.000004,68,1,1,6.302532512,0
118,poorly differentiated,2-5 cm,2,present,3062,0,not in trial,34,65.618073,III,Mucinous,non platinum-based,1,1,1847.9999,62.999992,1,0,8.38329911,0
119,poorly differentiated,2-5 cm,0,present,3248,1,not in trial,37,65.382614,III,Mucinous,platinum-based,1,1,2112.0002,128.99998,1,1,8.892539357,0
120,moderately differentiated,<2 cm,,absent,3160,1,in trial,,48.766598,I,Mucinous,none,1,0,,,1,1,8.651608487,0
121,,<2 cm,,absent,3270,0,in trial,,61.409992,I,Mesonephroid (clear cell),none,1,0,,55.000004,1,0,8.952772074,0
122,well differentiated,<2 cm,,present,3509,0,in trial,41,58.628338,III,Serous papillary,platinum-based,1,1,51.999996,48,1,0,9.607118412,0
123,poorly differentiated,>5 cm,,present,38,1,in trial,,68.235458,III,Mesonephroid (clear cell),none,1,0,,88.000008,1,1,0.10403833,0
124,poorly differentiated,<2 cm,,present,603,1,in trial,35,69.919235,III,Serous papillary,platinum-based,1,1,,108.00001,1,1,1.650924025,0
125,poorly differentiated,<2 cm,,present,8,1,in trial,,79.085556,III,Mucinous,none,1,0,,,1,1,0.021902806,0
126,poorly differentiated,>5 cm,1,present,605,1,in trial,30,55.373032,III,Serous papillary,platinum-based,1,1,9293.998,100.00001,1,1,1.656399726,0
127,,<2 cm,0,absent,1542,1,not in trial,43,60.9911,III,Mesonephroid (clear cell),non platinum-based,1,1,,42.000004,1,1,4.221765914,0
128,moderately differentiated,<2 cm,,present,329,1,in trial,,69.023956,I,Endometrioid,none,1,0,123.99999,,1,1,0.900752909,0
129,well differentiated,2-5 cm,0,present,480,1,not in trial,39,60.323067,III,Mesonephroid (clear cell),non platinum-based,1,1,477.00009,82.999985,1,1,1.314168378,0
130,poorly differentiated,<2 cm,1,present,452,1,not in trial,40,47.162216,III,Mucinous,non platinum-based,1,1,2110,98.000015,1,1,1.237508556,0
131,moderately differentiated,<2 cm,1,absent,453,1,in trial,,53.927448,I,Mucinous,platinum-based,1,1,,,1,1,1.240246407,0
132,moderately differentiated,2-5 cm,,present,457,1,not in trial,43,26.302532,IV,Serous papillary,non platinum-based,1,1,2424.9998,85,1,1,1.25119781,0
133,poorly differentiated,2-5 cm,0,present,151,1,not in trial,39,44.147842,III,Endometrioid,platinum-based,1,1,100.99999,64,1,1,0.413415469,0
134,poorly differentiated,2-5 cm,,present,35,1,in trial,,70.480492,III,Mucinous,none,1,0,,,1,1,0.095824778,0
135,,>5 cm,2,present,219,1,not in trial,39,53.385353,III,Serous papillary,non platinum-based,1,1,220.00002,177.00002,1,1,0.599589322,0
136,poorly differentiated,2-5 cm,1,present,538,1,in trial,,52.240932,IV,Serous papillary,platinum-based,1,1,,,1,1,1.472963723,0
137,poorly differentiated,>5 cm,0,present,2995,1,not in trial,37,61.585217,III,Serous papillary,non platinum-based,1,1,3569.9995,102,1,1,8.199863107,0
138,poorly differentiated,>5 cm,1,present,365,1,not in trial,34,67.512665,III,Serous papillary,platinum-based,1,1,292.00006,99.000008,1,1,0.999315537,0
139,,<2 cm,1,absent,1901,1,not in trial,44,49.158112,III,Serous papillary,non platinum-based,1,1,,85,1,1,5.204654346,0
140,poorly differentiated,<2 cm,,present,136,1,not in trial,44,34.809036,,Mucinous,platinum-based,1,1,33.000004,78.999992,1,1,0.372347707,0
141,well differentiated,<2 cm,0,absent,243,1,in trial,,44.279263,I,Mesonephroid (clear cell),none,1,0,,,1,1,0.665297741,0
142,moderately differentiated,<2 cm,0,absent,3635,0,in trial,46,17.672827,I,Endometrioid,none,1,0,46,76,1,0,9.952087611,0
143,moderately differentiated,<2 cm,,,1558,1,in trial,,53.557838,I,Mesonephroid (clear cell),none,1,0,,,1,1,4.265571526,0
144,poorly differentiated,>5 cm,1,present,252,1,not in trial,34,53.804245,III,Serous papillary,non platinum-based,1,1,156.00003,102.99999,1,1,0.689938398,0
145,poorly differentiated,>5 cm,2,present,115,1,in trial,38,56.733746,II,Mucinous,platinum-based,1,1,57.999996,123,1,1,0.314852841,0
146,poorly differentiated,<2 cm,1,present,292,1,in trial,,76.010948,III,Mixed mesodermal,none,1,0,,,1,1,0.79945243,0
147,poorly differentiated,<2 cm,0,present,1016,1,in trial,41,66.814514,I,Endometrioid,none,1,0,,73.000015,1,1,2.7816564,0
148,moderately differentiated,>5 cm,1,present,442,1,not in trial,28,76.632446,III,Serous papillary,non platinum-based,1,1,360.99997,156.00003,1,1,1.210130048,0
149,poorly differentiated,<2 cm,1,absent,1235,1,not in trial,42,63.890488,III,Serous papillary,non platinum-based,1,1,520.00012,128,1,1,3.381245722,0
150,poorly differentiated,>5 cm,0,absent,751,1,not in trial,48,59.446953,IV,Serous papillary,non platinum-based,1,1,152,109.00002,1,1,2.056125941,0
151,poorly differentiated,>5 cm,1,absent,61,1,in trial,33,64.958244,III,Serous papillary,platinum-based,0,1,3000.0002,184,1,1,0.167008898,0
152,poorly differentiated,<2 cm,1,present,165,1,in trial,33,68.454483,III,Mixed mesodermal,platinum-based,1,1,237.99995,102,1,1,0.45174538,0
153,poorly differentiated,>5 cm,,present,245,1,in trial,,68.405205,III,Serous papillary,platinum-based,1,1,,,1,1,0.670773443,0
154,poorly differentiated,<2 cm,0,present,2819,0,not in trial,46,51.63039,I,Mesonephroid (clear cell),platinum-based,1,1,20,102,1,0,7.718001369,0
155,poorly differentiated,>5 cm,1,present,745,1,not in trial,31,60.405201,III,Serous papillary,platinum-based,1,1,,150.99997,1,1,2.039698836,0
156,moderately differentiated,<2 cm,0,absent,2966,1,not in trial,38,55.572895,II,Serous papillary,non platinum-based,1,1,11.000001,82.999985,1,1,8.120465435,0
157,poorly differentiated,2-5 cm,,present,36,1,in trial,,72.476387,III,Serous papillary,none,1,0,,,1,1,0.098562628,0
158,moderately differentiated,<2 cm,1,absent,566,1,in trial,42,65.431892,I,Serous papillary,none,1,0,,96.999985,1,1,1.549623546,0
159,moderately differentiated,>5 cm,1,present,102,1,not in trial,30,62.11636,IV,Endometrioid,platinum-based,1,1,,354.00003,1,1,0.27926078,0
160,,>5 cm,1,present,224,1,in trial,40,76.928131,III,Serous papillary,none,1,0,,67.000015,1,1,0.613278576,0
161,moderately differentiated,<2 cm,,absent,2877,0,in trial,,70.346336,,Endometrioid,none,1,0,,,1,0,7.876796715,0
162,moderately differentiated,<2 cm,,absent,1370,1,not in trial,,54.959618,I,Endometrioid,none,1,0,,,1,1,3.750855578,0
163,poorly differentiated,2-5 cm,2,present,29,1,in trial,32,68.481865,III,Serous papillary,none,1,0,,100.00001,1,1,0.079397673,0
164,poorly differentiated,2-5 cm,,,1225,1,in trial,32,70.702255,III,Serous papillary,platinum-based,1,1,216.99995,111.00002,1,1,3.353867214,0
165,poorly differentiated,<2 cm,0,present,404,1,not in trial,37,65.689255,III,Serous papillary,non platinum-based,1,1,294.00003,159.00003,1,1,1.106091718,0
166,well differentiated,<2 cm,0,present,3617,0,in trial,41,69.136208,I,Mucinous,platinum-based,1,1,445.00006,81.000008,1,0,9.902806297,0
167,poorly differentiated,2-5 cm,0,present,241,1,in trial,41,75.101982,IV,Serous papillary,platinum-based,1,1,382.99991,85.999985,1,1,0.65982204,0
168,moderately differentiated,<2 cm,,absent,922,1,in trial,,69.935661,I,Mesonephroid (clear cell),none,1,0,23,,1,1,2.524298426,0
169,moderately differentiated,<2 cm,0,absent,2618,1,not in trial,37,66.198494,I,Mucinous,platinum-based,1,1,28.000002,274.00003,1,1,7.167693361,0
170,,>5 cm,,,162,1,in trial,28,70.286102,III,Serous papillary,platinum-based,1,1,173.00002,83.999985,1,1,0.443531828,0
171,poorly differentiated,<2 cm,0,absent,3415,0,in trial,43,47.70705,II,Mucinous,platinum-based,1,1,200.99995,69.999992,1,0,9.349760438,0
172,moderately differentiated,2-5 cm,2,present,63,1,not in trial,28,57.204655,III,Serous papillary,non platinum-based,1,1,,150.99997,1,1,0.1724846,0
173,poorly differentiated,,1,present,145,1,not in trial,,79.61396,III,Serous papillary,platinum-based,1,1,742,,1,1,0.396988364,0
174,well differentiated,<2 cm,,absent,1102,1,in trial,,86.02327,II,Mucinous,none,1,0,,,1,1,3.017111567,0